Target
Nuclear receptor ROR-gamma
Ligand
BDBM398030
Substrate
Meas. Tech.
TR-FRET Screening
IC50
550±n/a nM
Citation
 Xue, HZhao, TCha, MYKim, M N-benzoate group substituted benzopyrroline-2-one derivative and use thereof US Patent  US10322108 Publication Date 6/18/2019 
Target
Name:
Nuclear receptor ROR-gamma
Synonyms:
NR1F3 Nuclear receptor ROR-gamma (RORC) RAR-related orphan receptor C (RORc) RORG RZRG Retinoid-related orphan receptor-gamma (RORc)
Type:
Enzyme Catalytic Domain
Mol. Mass.:
58218.40
Organism:
Homo sapiens (Human)
Description:
P51449
Residue:
518
  
Inhibitor
Name:
BDBM398030
Synonyms:
US10322108, Example 26
Type:
Small organic molecule
Emp. Form.:
C26H17ClF3NO4
Mol. Mass.:
499.866
SMILES:
OC(=O)c1ccc(cc1O)N1C(=O)\C(=C/c2c(Cl)cccc2C2CC2)c2c1cccc2C(F)(F)F
: