Target
Cathepsin S
Ligand
BDBM31993
Substrate
BDBM22047
Meas. Tech.
Cathepsin Inhibition Assay
IC50
794±n/a nM
Citation
 Asaad, NBethel, PACoulson, MDDawson, JEFord, SJGerhardt, SGrist, MHamlin, GAJames, MJJones, EVKaroutchi, GIKenny, PWMorley, ADOldham, KRankine, NRyan, DWells, SLWood, LAugustin, MKrapp, SSimader, HSteinbacher, S Dipeptidyl nitrile inhibitors of Cathepsin L. Bioorg Med Chem Lett 19:4280-3 (2009)  
Target
Name:
Cathepsin S
Synonyms:
CATS_HUMAN Cathepsin S (Cat S) | cathepsin S preproprotein
Type:
Protein
Mol. Mass.:
37507.38
Organism:
Homo sapiens (Human)
Description:
P25774
Residue:
331
  
Inhibitor
Name:
BDBM31993
Synonyms:
Dipeptidyl nitrile inhibitor, 26
Type:
Small organic molecule
Emp. Form.:
C21H27N5O2
Mol. Mass.:
381.4714
SMILES:
Cc1cccc(C[C@H](NC(=O)c2cc(nn2C)C(C)(C)C)C(=O)NCC#N)c1
:
Substrate
Name:
BDBM22047
Synonyms:
CBZ-Phe-Arg 7-amido-4-methylcoumarin | Z-Phe-Arg-AMC
Type:
Fluorogenic substrate
Emp. Form.:
C33H36N6O6
Mol. Mass.:
612.6755
SMILES:
[#6]-c1cc(=O)oc2cc(-[#7]-[#6](=O)-[#6](-[#6]-[#6]-[#6]\[#7]=[#6](\[#7])-[#7])-[#7]-[#6](=O)-[#6](-[#6]-c3ccccc3)-[#7]-[#6](=O)-[#8]-[#6]-c3ccccc3)ccc12
: