Target
Proteinase-activated receptor 1
Ligand
BDBM398049
Substrate
Meas. Tech.
PAR-1 FLIPR Assay
IC50
6.20±n/a nM
Citation
 Yang, ZDong, GMaletic, M Preparation and use of 7a-heterocycle substituted-6,6-difluoro bicyclic himbacine derivatives as PAR-1 receptor antagonists US Patent  US10322140 Publication Date 6/18/2019 
Target
Name:
Proteinase-activated receptor 1
Synonyms:
CF2R F2R PAR1 Proteinase activated receptor 1 TR Thrombin receptor/ Proteinase-activated receptor 1(Par-1)
Type:
Protein
Mol. Mass.:
47450.07
Organism:
Homo sapiens (Human)
Description:
P25116
Residue:
425
  
Inhibitor
Name:
BDBM398049
Synonyms:
US10322140, Example 13
Type:
Small organic molecule
Emp. Form.:
C26H23F2N5O2
Mol. Mass.:
475.4899
SMILES:
C[C@H]1OC(=O)[C@@]2(CC(F)(F)[C@@H](C)[C@H](\C=C\c3ccc(cn3)-c3cccnc3C#N)[C@H]12)c1cc[nH]n1
: