Target
Proteinase-activated receptor 1
Ligand
BDBM398050
Substrate
Meas. Tech.
PAR-1 FLIPR Assay
IC50
1.34±n/a nM
Citation
 Yang, ZDong, GMaletic, M Preparation and use of 7a-heterocycle substituted-6,6-difluoro bicyclic himbacine derivatives as PAR-1 receptor antagonists US Patent  US10322140 Publication Date 6/18/2019 
Target
Name:
Proteinase-activated receptor 1
Synonyms:
CF2R F2R PAR1 Proteinase activated receptor 1 TR Thrombin receptor/ Proteinase-activated receptor 1(Par-1)
Type:
Protein
Mol. Mass.:
47450.07
Organism:
Homo sapiens (Human)
Description:
P25116
Residue:
425
  
Inhibitor
Name:
BDBM398050
Synonyms:
2-(6-((E)-2- ((3R,3aS,4R,5S,7aR)- 6,6-difluoro-3,5- dimethyl-1-oxo-7a-(5- oxo-4,5-dihydro-1,3,4- oxadiazol-2- yl)octahydroisobenzo furan-4-yl)vinyl) pyridin-3-yl)-6- methylbenzonitrile | US10322140, Example 2
Type:
Small organic molecule
Emp. Form.:
C27H24F2N4O4
Mol. Mass.:
506.5007
SMILES:
C[C@H]1OC(=O)[C@@]2(CC(F)(F)[C@@H](C)[C@H](\C=C\c3ccc(cn3)-c3cccc(C)c3C#N)[C@H]12)c1n[nH]c(=O)o1
: