Target
A disintegrin and metalloproteinase with thrombospondin motifs 4
Ligand
BDBM50345517
Substrate
Meas. Tech.
Immunoblotting
IC50
29.0±n/a nM
Citation
 Vistnes, MChristensen, GAronsen, MLunde, IGSjaastad, ICarlson, CR Inhibitors of ADAMTS4 or ADAMTS5 for use in preventing or treating cardiac remodeling and chronic heart failure US Patent  US10322143 Publication Date 6/18/2019 
Target
Name:
A disintegrin and metalloproteinase with thrombospondin motifs 4
Synonyms:
A disintegrin and metalloproteinase with thrombospondin motifs 4 (ADAMTS-4) ATS4_HUMAN KIAA0688 | Metalloproteinase with thrombospondin motifs 4 (ADAMTS-4)
Type:
Enzyme
Mol. Mass.:
90214.54
Organism:
Homo sapiens (Human)
Description:
O75173
Residue:
837
  
Inhibitor
Name:
BDBM50345517
Synonyms:
CHEMBL1784342 US10322143, Compound 14b
Type:
Small organic molecule
Emp. Form.:
C20H34N4O7S2
Mol. Mass.:
506.637
SMILES:
Cc1noc(C)c1CCC1CCN(CC1)S(=O)(=O)CC1(CCN(CC1)S(C)(=O)=O)N(O)C=O
: