Target
A disintegrin and metalloproteinase with thrombospondin motifs 5
Ligand
BDBM50311083
Substrate
Meas. Tech.
Immunoblotting
IC50
80.0±n/a nM
Citation
 Vistnes, MChristensen, GAronsen, MLunde, IGSjaastad, ICarlson, CR Inhibitors of ADAMTS4 or ADAMTS5 for use in preventing or treating cardiac remodeling and chronic heart failure US Patent  US10322143 Publication Date 6/18/2019 
Target
Name:
A disintegrin and metalloproteinase with thrombospondin motifs 5
Synonyms:
A disintegrin and metalloproteinase with thrombospondin motifs 5 (ADAMTS-5) ADAMTS5 ATS5_HUMAN Metalloproteinase with thrombospondin motifs 5 (ADAMTS-5)
Type:
Enzyme
Mol. Mass.:
101769.09
Organism:
Homo sapiens (Human)
Description:
Q9UNA0
Residue:
930
  
Inhibitor
Name:
BDBM50311083
Synonyms:
(1S,2R)-1-(5-(4-chloro-1H-pyrazol-1-yl)thiophene-2-sulfonamido)-2-phenylcyclopropanecarboxylic acid US10322143, Shiozaki Ciompound 9
Type:
Small organic molecule
Emp. Form.:
C17H14ClN3O4S2
Mol. Mass.:
423.894
SMILES:
OC(=O)[C@@]1(C[C@@H]1c1ccccc1)NS(=O)(=O)c1ccc(s1)-n1cc(Cl)cn1
: