Target
Heat shock protein HSP 90-alpha
Ligand
BDBM32146
Substrate
cy3B-GM
Meas. Tech.
Tumor Hsp90 Inhibitors Dose Response Confirmation
pH
7.4±n/a
Temperature
296.15±n/a K
IC50
50000±n/a nM
Citation
 PubChem, PC Tumor Hsp90 Inhibitors Dose Response Confirmation PubChem Bioassay (2007)[AID] 
Target
Name:
Heat shock protein HSP 90-alpha
Synonyms:
HS90A_HUMAN HSP86 HSP90AA1 HSPCA Heat shock 86 kDa Heat shock protein HSP 90-alpha (HSP90) LAP-2 Lipopolysaccharide-associated protein 2 heat shock protein 90kDa alpha (cytosolic), class A member 1 isoform 2
Type:
Molecular Chaperone
Mol. Mass.:
84623.45
Organism:
Homo sapiens (Human)
Description:
P07900
Residue:
732
  
Inhibitor
Name:
BDBM32146
Synonyms:
3,5-bis(2-pyridinylmethylidene)-4-piperidinone 3,5-bis(pyridin-2-ylmethylidene)piperidin-4-one cid_16072241
Type:
Small organic molecule
Emp. Form.:
C17H15N3O
Mol. Mass.:
277.3205
SMILES:
O=C1C(CNCC1=Cc1ccccn1)=Cc1ccccn1
:
Substrate
Name:
cy3B-GM
Synonyms:
fluorescently (Cy3B) labeled geldanamycin
Type:
fluorescent probe
Mol. Mass.:
358.43
Organism:
Description:
Residue:
3
NA