Target
Serine/threonine-protein kinase D1
Ligand
BDBM32347
Substrate
Substrate Peptide
Meas. Tech.
Fluorescence polarization assay for PKD inhibitiors-IC50 determinations
pH
7.2±n/a
Temperature
296.15±n/a K
IC50
>50000±n/a nM
Citation
 PubChem, PC Fluorescence polarization assay for PKD inhibitiors-IC50 determinations PubChem Bioassay (2008)[AID] 
Target
Name:
Serine/threonine-protein kinase D1
Synonyms:
KPCD1_HUMAN PKD1 PRKD1 Protein kinase C mu type Protein kinase C, PKC; classical/novel Protein kinase D (PRKD1) nPKC-D1 | nPKC-mu
Type:
Serine/threonine-protein kinase
Mol. Mass.:
101705.07
Organism:
Homo sapiens (Human)
Description:
gi_115529463
Residue:
912
  
Inhibitor
Name:
BDBM32347
Synonyms:
MLS000674332 N-[(4-fluorophenyl)methyl]-2-(methylthio)benzamide N-[(4-fluorophenyl)methyl]-2-methylsulfanylbenzamide cid_2592173
Type:
Small organic molecule
Emp. Form.:
C15H14FNOS
Mol. Mass.:
275.341
SMILES:
CSc1ccccc1C(=O)NCc1ccc(F)cc1
:
Substrate
Name:
Substrate Peptide
Synonyms:
Type:
Peptide
Mol. Mass.:
358.43
Organism:
Description:
ATP as co-substrate
Residue:
3
NA