Target
Heat shock 70 kDa protein 1A
Ligand
BDBM31995
Substrate
BDBM32369
Meas. Tech.
HSP70 Fluorescence Polarization Assay
pH
7.4±n/a
Temperature
296.15±n/a K
IC50
500±n/a nM
Citation
 Williamson, DSBorgognoni, JClay, ADaniels, ZDokurno, PDrysdale, MJFoloppe, NFrancis, GLGraham, CJHowes, RMacias, ATMurray, JBParsons, RShaw, TSurgenor, AETerry, LWang, YWood, MMassey, AJ Novel adenosine-derived inhibitors of 70 kDa heat shock protein, discovered through structure-based design. J Med Chem 52:1510-3 (2009)  
Target
Name:
Heat shock 70 kDa protein 1A
Synonyms:
HS71A_HUMAN HSP70.1 HSPA1 HSX70 Heat shock 70 kDa protein 1A/1B | Hsp70
Type:
Chaperone
Mol. Mass.:
70043.82
Organism:
Homo sapiens (Human)
Description:
Residue:
641
  
Inhibitor
Name:
BDBM31995
Synonyms:
ADP CHEMBL14830
Type:
Nucleoside or nucleotide
Emp. Form.:
C10H15N5O10P2
Mol. Mass.:
427.2011
SMILES:
Nc1ncnc2n(cnc12)[C@@H]1O[C@H](COP(O)(=O)OP(O)(O)=O)[C@@H](O)[C@H]1O
:
Substrate
Name:
BDBM32369
Synonyms:
N6-(6-amino)hexyl-ATP-5-FAM
Type:
fluorescein-labeled ATP-based probe
Emp. Form.:
C38H38N6O18P3
Mol. Mass.:
959.6607
SMILES:
O[C@@H]1[C@@H](COP([O-])(=O)OP([O-])(=O)OP(O)([O-])=O)O[C@H]([C@@H]1O)n1cnc2c(NCCCCCCNC(=O)c3ccc4c(c3)C(=O)OC43c4ccc(O)cc4Cc4cc(O)ccc34)ncnc12
: