Target
P2X purinoceptor 7
Ligand
BDBM398081
Substrate
Meas. Tech.
Pore Permeation Assay
IC50
55±n/a nM
Citation
 Karra, SR Indole derivatives and their use in neurodegenerative diseases US Patent  US10323000 Publication Date 6/18/2019 
Target
Name:
P2X purinoceptor 7
Synonyms:
ATP receptor P2RX7_HUMAN P2X purinoceptor 7 (P2X7) P2Z receptor | Purinergic receptor
Type:
Protein
Mol. Mass.:
68602.85
Organism:
Homo sapiens (Human)
Description:
Q99572
Residue:
595
  
Inhibitor
Name:
BDBM398081
Synonyms:
4-Chloro-1-(2-methoxy-ethyl)-1H-indole-3-carboxylic acid (4,4-difluoro-1-methoxy-cyclohexylmethyl)-amide US10676433, Compound 17
Type:
Small organic molecule
Emp. Form.:
C20H25ClF2N2O3
Mol. Mass.:
414.874
SMILES:
COCCn1cc(C(=O)NCC2(CCC(F)(F)CC2)OC)c2c(Cl)cccc12
: