Target
P2X purinoceptor 7
Ligand
BDBM398085
Substrate
Meas. Tech.
Pore Permeation Assay
IC50
<10±n/a nM
Citation
 Karra, SR Indole derivatives and their use in neurodegenerative diseases US Patent  US10323000 Publication Date 6/18/2019 
Target
Name:
P2X purinoceptor 7
Synonyms:
ATP receptor P2RX7_HUMAN P2X purinoceptor 7 (P2X7) P2Z receptor | Purinergic receptor
Type:
Protein
Mol. Mass.:
68602.85
Organism:
Homo sapiens (Human)
Description:
Q99572
Residue:
595
  
Inhibitor
Name:
BDBM398085
Synonyms:
(R)-4-chloro-N-((3,3-difluoro-1-hydroxycyclohexyl)methyl)-1-(2-methoxyethyl)-1H-indole-3-carboxamide US10676433, Compound 21
Type:
Small organic molecule
Emp. Form.:
C19H23ClF2N2O3
Mol. Mass.:
400.847
SMILES:
COCCn1cc(C(=O)NC[C@@]2(O)CCCC(F)(F)C2)c2c(Cl)cccc12
: