Target
Interleukin-1 beta
Ligand
BDBM398185
Substrate
Meas. Tech.
IL-1beta release assay
IC50
55±n/a nM
Citation
 Karra, SR Indole derivatives and their use in neurodegenerative diseases US Patent  US10323000 Publication Date 6/18/2019 
Target
Name:
Interleukin-1 beta
Synonyms:
IL1B IL1F2 Interleukin-1 beta | hIL-1beta
Type:
Cytokine
Mol. Mass.:
30734.47
Organism:
Homo sapiens (Human)
Description:
P01584
Residue:
269
  
Inhibitor
Name:
BDBM398185
Synonyms:
(S)-1-(azetidin-2-ylmethyl)-4-chloro-N-((4,4-difluorocyclohexyl)methyl)-1H-indole-3-carboxamide | US10323000, Compound 122
Type:
Small organic molecule
Emp. Form.:
C25H32ClF2N3O3
Mol. Mass.:
495.99
SMILES:
CC(C)(C)OC(=O)N1CC[C@H]1Cn1cc(C(=O)NCC2CCC(F)(F)CC2)c2c(Cl)cccc12
: