Target
Interleukin-1 beta
Ligand
BDBM398187
Substrate
Meas. Tech.
IL-1beta release assay
IC50
55±n/a nM
Citation
 Karra, SR Indole derivatives and their use in neurodegenerative diseases US Patent  US10323000 Publication Date 6/18/2019 
Target
Name:
Interleukin-1 beta
Synonyms:
IL1B IL1F2 Interleukin-1 beta | hIL-1beta
Type:
Cytokine
Mol. Mass.:
30734.47
Organism:
Homo sapiens (Human)
Description:
P01584
Residue:
269
  
Inhibitor
Name:
BDBM398187
Synonyms:
1-(azetidin-2-ylmethyl)-4-chloro-N-((3,3-difluoro-1-hydroxycyclohexyl) methyl)-1H-indole-3-carboxamide US10676433, Compound 124
Type:
Small organic molecule
Emp. Form.:
C20H24ClF2N3O2
Mol. Mass.:
411.873
SMILES:
OC1(CNC(=O)c2cn(CC3CCN3)c3cccc(Cl)c23)CCCC(F)(F)C1
: