Target
Interleukin-1 beta
Ligand
BDBM398209
Substrate
Meas. Tech.
IL-1beta release assay
IC50
55±n/a nM
Citation
 Karra, SR Indole derivatives and their use in neurodegenerative diseases US Patent  US10323000 Publication Date 6/18/2019 
Target
Name:
Interleukin-1 beta
Synonyms:
IL1B IL1F2 Interleukin-1 beta | hIL-1beta
Type:
Cytokine
Mol. Mass.:
30734.47
Organism:
Homo sapiens (Human)
Description:
P01584
Residue:
269
  
Inhibitor
Name:
BDBM398209
Synonyms:
4-chloro-N-((4,4-difluoro-1-hydroxycyclohexyl) methyl)-1-((tetrahydrofuran-3-yl)methyl)-1H-indole-3-carboxamide US10676433, Compound 147
Type:
Small organic molecule
Emp. Form.:
C21H25ClF2N2O3
Mol. Mass.:
426.885
SMILES:
OC1(CNC(=O)c2cn(CC3CCOC3)c3cccc(Cl)c23)CCC(F)(F)CC1
: