Target
3-phosphoinositide-dependent protein kinase 1 [48-359]
Ligand
BDBM32443
Substrate
Serine/threonine-protein kinase Sgk1
Meas. Tech.
ELISA assay
IC50
383±n/a nM
Citation
 Kim, KHWissner, AFloyd, MBFraser, HLWang, YDDushin, RGHu, YOlland, AGuo, BArndt, K Benzo[c][2,7]naphthyridines as inhibitors of PDK-1. Bioorg Med Chem Lett 19:5225-8 (2009)  
Target
Name:
3-phosphoinositide-dependent protein kinase 1 [48-359]
Synonyms:
3-Phosphoinositide-Dependent Protein Kinase 1 (PDK1) PDK1 PDPK1_HUMAN | hPDK1
Type:
Serine/threonine-protein kinase
Mol. Mass.:
35527.50
Organism:
Homo sapiens (Human)
Description:
O15530[48-359]
Residue:
312
  
Inhibitor
Name:
BDBM32443
Synonyms:
Benzo[c][2,7]naphthyridine, 35
Type:
Small organic molecule
Emp. Form.:
C26H23N5O3
Mol. Mass.:
453.4925
SMILES:
COc1ccc(Nc2cncc(c2)-c2cc3c(cnc4cc(OC)c(OC)cc34)c(N)n2)cc1
:
Substrate
Name:
Serine/threonine-protein kinase Sgk1
Synonyms:
SGK SGK1_HUMAN Serine/threonine-protein kinase Sgk1 (SGK) Serum/glucocorticoid-regulated kinase 1 (SGK1)
Type:
Other Protein Type
Mol. Mass.:
48954.40
Organism:
Homo sapiens (Human)
Description:
Recombinant human SGK-1 enzyme produced in a baculovirus system.
Residue:
431