Target
Nicotinamide phosphoribosyltransferase
Ligand
BDBM398370
Substrate
Meas. Tech.
NAMPT Enzyme Assay
IC50
<10±n/a nM
Citation
 Freeze, BSGigstad, KMJanowick, DALee, HMShi, ZSoucy, FVyskocil, S Quinazoline and quinoline compounds and uses thereof US Patent  US10323018 Publication Date 6/18/2019 
Target
Name:
Nicotinamide phosphoribosyltransferase
Synonyms:
NAMPT NAmPRTase Nicotinamide phosphoribosyltransferase (NAMPT) PBEF1 | Pre-B-cell colony-enhancing factor 1
Type:
Enzyme
Mol. Mass.:
55524.98
Organism:
Homo sapiens (Human)
Description:
P43490
Residue:
491
  
Inhibitor
Name:
BDBM398370
Synonyms:
US10323018, Compound I-99
Type:
Small organic molecule
Emp. Form.:
C25H22N6O2
Mol. Mass.:
438.4812
SMILES:
CCOc1cc(nc2cc(ccc12)C(=O)NCc1nc2cnccc2[nH]1)-c1ccnc(C)c1
: