Target
Isoform Alpha-1 of Mitogen-activated protein kinase 10 (Alpha-1) 9-402]
Ligand
BDBM32481
Substrate
biotinylated-ATF2
Meas. Tech.
Homogeneous Time-resolved Fluorescence Assay
pH
7±n/a
Temperature
295.15±n/a K
IC50
5800±n/a nM
Citation
 Shin, YChen, WHabel, JDuckett, DLing, YYKoenig, MHe, YVojkovsky, TLoGrasso, PKamenecka, TM Synthesis and SAR of piperazine amides as novel c-jun N-terminal kinase (JNK) inhibitors. Bioorg Med Chem Lett 19:3344-7 (2009)  
Target
Name:
Isoform Alpha-1 of Mitogen-activated protein kinase 10 (Alpha-1) 9-402]
Synonyms:
JNK3 MAP kinase p49 3F12 MK10_HUMAN Mitogen-activated protein kinase 10 (Alpha-1) [39-402] SAPK1B | Stress-activated protein kinase JNK3
Type:
Serine/threonine-protein kinase
Mol. Mass.:
42009.30
Organism:
Homo sapiens (Human)
Description:
P53779-2[39-402]
Residue:
364
  
Inhibitor
Name:
BDBM32481
Synonyms:
piperazine amide, 6h
Type:
Small organic molecule
Emp. Form.:
C18H21ClN4OS
Mol. Mass.:
376.904
SMILES:
Cc1nc(cs1)C(=O)Nc1cccc(Cl)c1N1CCN(CC=C)CC1
:
Substrate
Name:
biotinylated-ATF2
Synonyms:
Activating transcription factor 2 cAMP response element-binding protein CRE-BP1
Type:
Other Protein Type
Mol. Mass.:
13150.37
Organism:
Homo sapiens (Human)
Description:
ATF-2 (aa 1-115) was expressed and purified from E. coli.
Residue:
115