Target
Potassium voltage-gated channel subfamily H member 2
Ligand
BDBM396879
Substrate
Meas. Tech.
hERG receptor binding assay
IC50
4.29±n/a nM
Citation
 Schindler, RLankau, HHöfgen, NEgerland, ULangen, BDost, RWard, S Triazoles as NR2B receptor inhibitors US Patent  US10323021 Publication Date 6/18/2019 
Target
Name:
Potassium voltage-gated channel subfamily H member 2
Synonyms:
1,3-beta-glucan synthase component GLS2 ERG Eag-related protein 1 Ether-a-go-go-related gene (HERG) Ether-a-go-go-related gene potassium channel 1 Ether-a-go-go-related gene potassium channel 1 (hERG1) Ether-a-go-go-related protein 1 H-ERG KCNH2 Potassium voltage-gated channel subfamily H member 2 (hERG) Voltage-gated potassium channel subunit Kv11.1 hERG Potassium Channel 1 | putative potassium channel subunit
Type:
Multi-pass membrane protein
Mol. Mass.:
126672.65
Organism:
Homo sapiens (Human)
Description:
Q12809
Residue:
1159
  
Inhibitor
Name:
BDBM396879
Synonyms:
US9981950, Example 86
Type:
Small organic molecule
Emp. Form.:
C17H18F3N5
Mol. Mass.:
349.3535
SMILES:
CCCCc1nccn1Cc1cn(nn1)-c1ccc(F)c(c1)C(F)F
: