Target
11-beta-hydroxysteroid dehydrogenase 1 [24-292,C272S]
Ligand
BDBM32568
Substrate
BDBM13739
Meas. Tech.
Human 11beta-HSD1 SPA Assay
IC50
17±n/a nM
EC50
>1000±n/a nM
Citation
 Sun, DWang, ZDi, YJaen, JCLabelle, MMa, JMiao, SSudom, ATang, LTomooka, CSTu, HUrsu, SWalker, NYan, XYe, QPowers, JP Discovery and initial SAR of arylsulfonylpiperazine inhibitors of 11beta-hydroxysteroid dehydrogenase type 1 (11beta-HSD1). Bioorg Med Chem Lett 18:3513-6 (2008)  
Target
Name:
11-beta-hydroxysteroid dehydrogenase 1 [24-292,C272S]
Synonyms:
11-DH Corticosteroid 11-beta-dehydrogenase isozyme 1 HSD11 HSD11L | SDR26C1
Type:
Homodimer
Mol. Mass.:
31804.08
Organism:
Homo sapiens (Human)
Description:
Purified recombinant human 11beta-HSD1.
Residue:
286
  
Inhibitor
Name:
BDBM32568
Synonyms:
arylsulfonylpiperazine, 40
Type:
Small organic molecule
Emp. Form.:
C22H28F3N3O2S
Mol. Mass.:
455.537
SMILES:
CCC1CN(CCN1S(=O)(=O)c1ccc(cc1)C(C)(C)C)c1ncccc1C(F)(F)F
:
Substrate
Name:
BDBM13739
Synonyms:
(1S,2R,10S,11S,14R,15S)-14-hydroxy-14-(2-hydroxyacetyl)-2,15-dimethyltetracyclo[8.7.0.0^{2,7}.0^{11,15}]heptadec-6-ene-5,17-dione [3H]cortisone | cortisone
Type:
Steroid
Emp. Form.:
C21H28O5
Mol. Mass.:
360.444
SMILES:
[H][C@@]12CC[C@](O)(C(=O)CO)[C@@]1(C)CC(=O)[C@@]1([H])[C@@]2([H])CCC2=CC(=O)CC[C@]12C
: