Target
11-beta-hydroxysteroid dehydrogenase 1
Ligand
BDBM32571
Substrate
BDBM13739
IC50
4±n/a nM
Citation
 Sun, DWang, ZDi, YJaen, JCLabelle, MMa, JMiao, SSudom, ATang, LTomooka, CSTu, HUrsu, SWalker, NYan, XYe, QPowers, JP Discovery and initial SAR of arylsulfonylpiperazine inhibitors of 11beta-hydroxysteroid dehydrogenase type 1 (11beta-HSD1). Bioorg Med Chem Lett 18:3513-6 (2008)  
Target
Name:
11-beta-hydroxysteroid dehydrogenase 1
Synonyms:
11-DH 11-beta-Hydroxysteroid Dehydrogenase 1 (11-beta-HSD1) 11beta-HSD1A Corticosteroid 11-beta-dehydrogenase isozyme 1 (11-beta-HSD-1) Hsd11 | Hsd11b1
Type:
Enzyme
Mol. Mass.:
32369.70
Organism:
Mus musculus (mouse)
Description:
P50172
Residue:
292
  
Inhibitor
Name:
BDBM32571
Synonyms:
arylsulfonylpiperazine, 43
Type:
Small organic molecule
Emp. Form.:
C21H26F3N3O2S
Mol. Mass.:
441.51
SMILES:
C[C@@H]1CN(CCN1S(=O)(=O)c1ccc(cc1)C(C)(C)C)c1ncccc1C(F)(F)F
:
Substrate
Name:
BDBM13739
Synonyms:
(1S,2R,10S,11S,14R,15S)-14-hydroxy-14-(2-hydroxyacetyl)-2,15-dimethyltetracyclo[8.7.0.0^{2,7}.0^{11,15}]heptadec-6-ene-5,17-dione [3H]cortisone | cortisone
Type:
Steroid
Emp. Form.:
C21H28O5
Mol. Mass.:
360.444
SMILES:
[H][C@@]12CC[C@](O)(C(=O)CO)[C@@]1(C)CC(=O)[C@@]1([H])[C@@]2([H])CCC2=CC(=O)CC[C@]12C
: