Target
High affinity nerve growth factor receptor
Ligand
BDBM398974
Substrate
Meas. Tech.
TrkA Omnia Assay
IC50
<100±n/a nM
Citation
 Allen, SAndrews, SWBlake, JFCondroski, KRHaas, JHuang, LJiang, YKercher, TKolakowski, GRSeo, J Pyrrolidinyl urea, pyrrolidinyl thiourea and pyrrolidinyl guanidine compounds as TrkA kinase inhibitors US Patent  US10323022 Publication Date 6/18/2019 
Target
Name:
High affinity nerve growth factor receptor
Synonyms:
2.7.10.1 NTRK1 NTRK1_HUMAN Neurotrophic tyrosine kinase receptor type 1 Synonyms=MTC TRK1-transforming tyrosine kinase protein TRKA GN Tropomyosin alpha-3 chain/High affinity nerve growth factor receptor Tropomyosin-related kinase A (TrkA) Tyrosine kinase receptor (Trk) Tyrosine kinase receptor A (Trk A) Tyrosine kinase receptor A (TrkA) p140-TrkA
Type:
Mol. Mass.:
87498.18
Organism:
Homo sapiens (Human)
Description:
P04629
Residue:
796
  
Inhibitor
Name:
BDBM398974
Synonyms:
US10323022, Example 451
Type:
Small organic molecule
Emp. Form.:
C28H33F2N5O3
Mol. Mass.:
525.5901
SMILES:
COCCN1C[C@@H](NC(=O)Nc2c(C)c(nn2-c2ccccc2)[C@H]2C[C@H](O)C2)[C@@H](C1)c1ccc(F)c(F)c1
: