Target
Rho-associated protein kinase 2
Ligand
BDBM398658
Substrate
Meas. Tech.
HTRF KinEASE-STK S2 kit
IC50
236±n/a nM
Citation
 Zhao, YWang, HLi, GJiang, YLi, XZhou, LLiu, Y Rho-associated protein kinase inhibitor, pharmaceutical composition comprising the same, as well as preparation method and use thereof US Patent  US10323023 Publication Date 6/18/2019 
Target
Name:
Rho-associated protein kinase 2
Synonyms:
KIAA0619 ROCK2 Rho kinase 2 (ROCKII) Rho-associated protein kinase 2 (ROCK2) Rho-associated protein kinase 2/Transforming protein RhoA Rho-associated, coiled-coil-containing protein kinase II p164 ROCK-2
Type:
Protein
Mol. Mass.:
160885.43
Organism:
Homo sapiens (Human)
Description:
O75116
Residue:
1388
  
Inhibitor
Name:
BDBM398658
Synonyms:
US10323023, Compound TDI01116 | US11390609, Compound TDI01116
Type:
Small organic molecule
Emp. Form.:
C24H16N8OS
Mol. Mass.:
464.502
SMILES:
O=C(Nc1ccnnc1)c1cc2ccc(cc2s1)-c1nccc(Nc2ccc3[nH]ncc3c2)n1
: