Target
Rho-associated protein kinase 2
Ligand
BDBM399175
Substrate
Meas. Tech.
HTRF KinEASE-STK S2 kit
IC50
197±n/a nM
Citation
 Zhao, YWang, HLi, GJiang, YLi, XZhou, LLiu, Y Rho-associated protein kinase inhibitor, pharmaceutical composition comprising the same, as well as preparation method and use thereof US Patent  US10323023 Publication Date 6/18/2019 
Target
Name:
Rho-associated protein kinase 2
Synonyms:
KIAA0619 ROCK2 Rho kinase 2 (ROCKII) Rho-associated protein kinase 2 (ROCK2) Rho-associated protein kinase 2/Transforming protein RhoA Rho-associated, coiled-coil-containing protein kinase II p164 ROCK-2
Type:
Protein
Mol. Mass.:
160885.43
Organism:
Homo sapiens (Human)
Description:
O75116
Residue:
1388
  
Inhibitor
Name:
BDBM399175
Synonyms:
US10323023, Compound TDI01175
Type:
Small organic molecule
Emp. Form.:
C26H19N9OS
Mol. Mass.:
505.554
SMILES:
O=C(Nc1ccnnc1)c1cc2ccc(cc2[nH]1)C1NC(Nc2ccc3[nH]ncc3c2)=c2sccc2=N1
: