Target
Baculoviral IAP repeat-containing protein 2 [269-336]
Ligand
BDBM32578
Substrate
BDBM17342
Meas. Tech.
Fluorescence Polarization Affinity Measurements
pH
7.2±n/a
Temperature
295.15±n/a K
Ki
10±n/a nM
Citation
 Ndubaku, CVarfolomeev, EWang, LZobel, KLau, KElliott, LOMaurer, BFedorova, AVDynek, JNKoehler, MHymowitz, SGTsui, VDeshayes, KFairbrother, WJFlygare, JAVucic, D Antagonism of c-IAP and XIAP proteins is required for efficient induction of cell death by small-molecule IAP antagonists. ACS Chem Biol 4:557-66 (2009)  
Target
Name:
Baculoviral IAP repeat-containing protein 2 [269-336]
Synonyms:
API1 BIRC2_HUMAN IAP homolog B MIHB cIAP-1 BIR3
Type:
BIR3 domain
Mol. Mass.:
7949.91
Organism:
Homo sapiens (Human)
Description:
Q13490[269-336]
Residue:
68
  
Inhibitor
Name:
BDBM32578
Synonyms:
CS-1
Type:
Small organic molecule
Emp. Form.:
C28H40N6O3
Mol. Mass.:
508.6556
SMILES:
CN[C@@H](C)C(=O)N[C@@H](C1CCCCC1)C(=O)N1CC[C@H](C)[C@H]1C(=O)Nc1cc(C)nn1-c1ccccc1
:
Substrate
Name:
BDBM17342
Synonyms:
5-carboxyflourescein(5-FAM)-conjugated AVPFFAKK | AVP-diPhe-FAM
Type:
Fluorescent dye-conjugated peptide
Emp. Form.:
Mol. Mass.:
SMILES:
: