Target
Baculoviral IAP repeat-containing protein 3
Ligand
BDBM26203
Substrate
Smac-derived peptide
Meas. Tech.
Fluorescence Polarization Assay
pH
7.5±n/a
Temperature
296.15±n/a K
IC50
270±n/a nM
Citation
 Seneci, PBianchi, ABattaglia, CBelvisi, LBolognesi, MCaprini, ACossu, FFranco, EMatteo, MDelia, DDrago, CKhaled, ALecis, DManzoni, LMarizzoni, MMastrangelo, EMilani, MMotto, IMoroni, EPotenza, DRizzo, VServida, FTurlizzi, EVarrone, MVasile, FScolastico, C Rational design, synthesis and characterization of potent, non-peptidic Smac mimics/XIAP inhibitors as proapoptotic agents for cancer therapy. Bioorg Med Chem 17:5834-56 (2009)  
Target
Name:
Baculoviral IAP repeat-containing protein 3
Synonyms:
API2 BIRC3_HUMAN Baculoviral IAP repeat-containing protein 3 (IAP1 BIR3) MIHC XIAP-BIR3 | cIAP1/cIAP2
Type:
Protein
Mol. Mass.:
68365.75
Organism:
Homo sapiens (Human)
Description:
Q13489
Residue:
604
  
Inhibitor
Name:
BDBM26203
Synonyms:
(3S,6S,7S,9aS)-6-[(2S)-2-aminobutanamido]-N-(diphenylmethyl)-7-(hydroxymethyl)-5-oxo-octahydro-1H-pyrrolo[1,2-a]azepine-3-carboxamide Smac005
Type:
Small organic molecule
Emp. Form.:
C28H36N4O4
Mol. Mass.:
492.6098
SMILES:
CC[C@H](N)C(=O)N[C@H]1[C@@H](CO)CC[C@H]2CC[C@H](N2C1=O)C(=O)NC(c1ccccc1)c1ccccc1
:
Substrate
Name:
Smac-derived peptide
Synonyms:
SM5F
Type:
fluorescently labelled peptide
Mol. Mass.:
1220.95
Organism:
Description:
5-carboxyfluorescein was coupled to the lysine side chain of the mutated Smac peptide.
Residue:
10
ARPFKFAMNH