Target
Sphingosine 1-phosphate receptor 3
Ligand
BDBM399310
Substrate
Meas. Tech.
TBD
IC50
31.0±n/a nM
Citation
 Roberts, ERosen, HUrbano, MGuerrero, MA Sphinogosine-1-phosphate receptor modulators for treatment of cardiopulmonary disorders US Patent  US10323029 Publication Date 6/18/2019 
Target
Name:
Sphingosine 1-phosphate receptor 3
Synonyms:
C9orf108 EDG3 S1P receptor 3 S1P3 S1PR3_HUMAN Sphingosine 1-phosphate receptor 3 (S1P3) | Sphingosine 1-phosphate receptor Edg-3
Type:
G Protein-Coupled Receptor (GPCR)
Mol. Mass.:
42278.13
Organism:
Homo sapiens (Human)
Description:
Q99500
Residue:
378
  
Inhibitor
Name:
BDBM399310
Synonyms:
US10323029, Generic formula 52617 IB | US11034691, CYM generic formula 52617 IB
Type:
Small organic molecule
Emp. Form.:
C21H14Cl3N5O
Mol. Mass.:
458.728
SMILES:
Clc1ccc(nc1)[C@@H](NC(=O)c1ccc(cc1)-n1cncn1)c1ccc(Cl)c(Cl)c1
: