Target
Sphingosine 1-phosphate receptor 3
Ligand
BDBM399397
Substrate
Meas. Tech.
TBD
IC50
6.00±n/a nM
Citation
 Roberts, ERosen, HUrbano, MGuerrero, MA Sphinogosine-1-phosphate receptor modulators for treatment of cardiopulmonary disorders US Patent  US10323029 Publication Date 6/18/2019 
Target
Name:
Sphingosine 1-phosphate receptor 3
Synonyms:
C9orf108 EDG3 S1P receptor 3 S1P3 S1PR3_HUMAN Sphingosine 1-phosphate receptor 3 (S1P3) | Sphingosine 1-phosphate receptor Edg-3
Type:
G Protein-Coupled Receptor (GPCR)
Mol. Mass.:
42278.13
Organism:
Homo sapiens (Human)
Description:
Q99500
Residue:
378
  
Inhibitor
Name:
BDBM399397
Synonyms:
US10323029, Generic formula 52718 IB | US11034691, CYM generic formula 52718 IB
Type:
Small organic molecule
Emp. Form.:
C20H10Cl2F3N3O
Mol. Mass.:
436.214
SMILES:
Fc1cc(ccc1Cl)[C@H](NC(=O)c1ccc(C#N)c(F)c1)c1ncc(Cl)cc1F
: