Target
P2X purinoceptor 7
Ligand
BDBM173399
Substrate
Meas. Tech.
Radioligand binding assay
Ki
25.1±n/a nM
Citation
 Alcazar Vaca, MJAndres Gil, JILetavic, MARudolph, DAShireman, BTStenne, BMZiff, JM P2X7 Modulators US Patent  US10323032 Publication Date 6/18/2019 
Target
Name:
P2X purinoceptor 7
Synonyms:
ATP receptor P2RX7_HUMAN P2X purinoceptor 7 (P2X7) P2Z receptor | Purinergic receptor
Type:
Protein
Mol. Mass.:
68602.85
Organism:
Homo sapiens (Human)
Description:
Q99572
Residue:
595
  
Inhibitor
Name:
BDBM173399
Synonyms:
US10323032, Example 112 US9604982, Example 112
Type:
Small organic molecule
Emp. Form.:
C19H15ClF3N5O
Mol. Mass.:
421.804
SMILES:
CC1N(CCc2c1ncnc2-c1ccn[nH]1)C(=O)c1cccc(c1Cl)C(F)(F)F
: