Target
Broad substrate specificity ATP-binding cassette transporter ABCG2
Ligand
BDBM32628
Substrate
BDBM32618
Meas. Tech.
Screening Assay for ABCG2 Inhibitors
pH
7.4±n/a
Temperature
310.15±n/a K
IC50
790±10 nM
Comments
Max activity (% FTC)=100.
Citation
 Henrich, CJRobey, RWTakada, KBokesch, HRBates, SEShukla, SAmbudkar, SVMcMahon, JBGustafson, KR Botryllamides: Natural Product Inhibitors of ABCG2. ACS Chem Biol 4:637-47 (2009)  
Target
Name:
Broad substrate specificity ATP-binding cassette transporter ABCG2
Synonyms:
ABCG2 ABCP ATP-binding cassette sub-family G member 2 ATP-binding cassette, sub-family G, member 2 BCRP1 CDw338 Mitoxantrone resistance-associated protein Urate exporter
Type:
Multi-pass membrane protein; monomer or homodimer; disulfide-linked
Mol. Mass.:
72329.48
Organism:
Homo sapiens (Human)
Description:
Q9UNQ0
Residue:
655
  
Inhibitor
Name:
BDBM32628
Synonyms:
FTC | Fumitremorgin C
Type:
Small organic molecule
Emp. Form.:
C22H25N3O3
Mol. Mass.:
379.4522
SMILES:
[H][C@@]12CCCN1C(=O)[C@]1([H])Cc3c([nH]c4cc(OC)ccc34)[C@H](C=C(C)C)N1C2=O
:
Substrate
Name:
BDBM32618
Synonyms:
NSC75783 pheophorbide a
Type:
Emp. Form.:
C35H36N4O5
Mol. Mass.:
592.6841
SMILES:
CCc1c(C)c2cc3[nH]c(cc4nc([C@@H](CCC(O)=O)[C@@H]4C)c4c(C(=O)OC)c(O)c5c(C)c(cc1[nH]2)nc45)c(C)c3C=C
: