Target
Coagulation factor XI
Ligand
BDBM32723
Substrate
Boc-Glu-Ala-Arg-AMC
Meas. Tech.
Factor XIa Dose Response Confirmation from Single Well Screen
pH
7.4±n/a
Temperature
296.15±n/a K
IC50
>50000±0 nM
Citation
 PubChem, PC Factor XIa Dose Response Confirmation from Single Well Screen PubChem Bioassay (2008)[AID] 
Target
Name:
Coagulation factor XI
Synonyms:
Coagulation factor XIa Coagulation factor XIa light chain FA11_HUMAN Factor XIa PTA | Plasma thromboplastin antecedent
Type:
Enzyme
Mol. Mass.:
70130.58
Organism:
Homo sapiens (Human)
Description:
P03951
Residue:
625
  
Inhibitor
Name:
BDBM32723
Synonyms:
8-ethoxy-N-[(4-methoxyphenyl)methyl]-5-quinolinesulfonamide 8-ethoxy-N-p-anisyl-quinoline-5-sulfonamide SMR000131992 | cid_9551290
Type:
Small organic molecule
Emp. Form.:
C19H20N2O4S
Mol. Mass.:
372.438
SMILES:
CCOc1ccc(c2cccnc12)S(=O)(=O)NCc1ccc(OC)cc1
:
Substrate
Name:
Boc-Glu-Ala-Arg-AMC
Synonyms:
Type:
fluorescent substrate peptide
Mol. Mass.:
358.43
Organism:
Description:
Residue:
3
NA