Target
Coagulation factor XI
Ligand
BDBM32796
Substrate
Boc-Glu-Ala-Arg-AMC
Meas. Tech.
Factor XIa 1536 HTS Dose Response Confirmation
pH
7.4±n/a
Temperature
296.15±n/a K
IC50
530.6±111.9 nM
Citation
 PubChem, PC Factor XIa 1536 HTS Dose Response Confirmation PubChem Bioassay (2008)[AID] 
Target
Name:
Coagulation factor XI
Synonyms:
Coagulation factor XIa Coagulation factor XIa light chain FA11_HUMAN Factor XIa PTA | Plasma thromboplastin antecedent
Type:
Enzyme
Mol. Mass.:
70130.58
Organism:
Homo sapiens (Human)
Description:
P03951
Residue:
625
  
Inhibitor
Name:
BDBM32796
Synonyms:
MLS000115326 [3-(2-furanyl)-5-(methylthio)-1,2,4-triazol-1-yl]-(4-methylphenyl)methanone [3-(furan-2-yl)-5-methylsulfanyl-1,2,4-triazol-1-yl]-(4-methylphenyl)methanone | cid_1088428
Type:
Small organic molecule
Emp. Form.:
C15H13N3O2S
Mol. Mass.:
299.348
SMILES:
CSc1nc(nn1C(=O)c1ccc(C)cc1)-c1ccco1
:
Substrate
Name:
Boc-Glu-Ala-Arg-AMC
Synonyms:
Type:
fluorescent substrate peptide
Mol. Mass.:
358.43
Organism:
Description:
Residue:
3
NA