Target
Coagulation factor XI
Ligand
BDBM32803
Substrate
Boc-Glu-Ala-Arg-AMC
Meas. Tech.
Factor XIa 1536 HTS Dose Response Confirmation
pH
7.4±n/a
Temperature
296.15±n/a K
IC50
1502.846667±192.327286 nM
Citation
 PubChem, PC Factor XIa 1536 HTS Dose Response Confirmation PubChem Bioassay (2008)[AID] 
Target
Name:
Coagulation factor XI
Synonyms:
Coagulation factor XIa Coagulation factor XIa light chain FA11_HUMAN Factor XIa PTA | Plasma thromboplastin antecedent
Type:
Enzyme
Mol. Mass.:
70130.58
Organism:
Homo sapiens (Human)
Description:
P03951
Residue:
625
  
Inhibitor
Name:
BDBM32803
Synonyms:
(2-acetyl-1-benzothiophen-3-yl) furan-2-carboxylate 2-furancarboxylic acid (2-acetyl-1-benzothiophen-3-yl) ester SMR000109355 furan-2-carboxylic acid (2-acetylbenzothiophen-3-yl) ester
Type:
Small organic molecule
Emp. Form.:
C15H10O4S
Mol. Mass.:
286.303
SMILES:
CC(=O)c1sc2ccccc2c1OC(=O)c1ccco1
:
Substrate
Name:
Boc-Glu-Ala-Arg-AMC
Synonyms:
Type:
fluorescent substrate peptide
Mol. Mass.:
358.43
Organism:
Description:
Residue:
3
NA