Target
Coagulation factor XI
Ligand
BDBM33004
Substrate
Boc-Glu-Ala-Arg-AMC
Meas. Tech.
Factor XIa 1536 HTS Dose Response Confirmation
pH
7.4±n/a
Temperature
296.15±n/a K
IC50
2925.233333±578.318334 nM
Citation
 PubChem, PC Factor XIa 1536 HTS Dose Response Confirmation PubChem Bioassay (2008)[AID] 
Target
Name:
Coagulation factor XI
Synonyms:
Coagulation factor XIa Coagulation factor XIa light chain FA11_HUMAN Factor XIa PTA | Plasma thromboplastin antecedent
Type:
Enzyme
Mol. Mass.:
70130.58
Organism:
Homo sapiens (Human)
Description:
P03951
Residue:
625
  
Inhibitor
Name:
BDBM33004
Synonyms:
2-(2-Bromo-phenyl)-6-methyl-thieno[2,3-d][1,3]oxazin-4-one 2-(2-bromophenyl)-6-methyl-thieno[2,3-d][1,3]oxazin-4-one MLS000767779 cid_3796366
Type:
Small organic molecule
Emp. Form.:
C13H8BrNO2S
Mol. Mass.:
322.177
SMILES:
Cc1cc2c(nc(oc2=O)-c2ccccc2Br)s1
:
Substrate
Name:
Boc-Glu-Ala-Arg-AMC
Synonyms:
Type:
fluorescent substrate peptide
Mol. Mass.:
358.43
Organism:
Description:
Residue:
3
NA