Target
Bcl-2-related protein A1
Ligand
BDBM33056
Substrate
FITC-conjugated-Bim BH3 Peptide
Meas. Tech.
Multiplexed dose response screen for small molecule regulators of Bcl-2 family protein interactions, specifically Bim-Bfl-1.
pH
7.4±n/a
Temperature
277.15±n/a K
EC50
57270±n/a nM
Citation
 PubChem, PC Multiplexed dose response screen for small molecule regulators of Bcl-2 family protein interactions, specifically Bim-Bfl-1. PubChem Bioassay (2008)[AID] 
Target
Name:
Bcl-2-related protein A1
Synonyms:
B2LA1_HUMAN BCL2L5 Bcl-2-like protein 5 HBPA1 Protein BFL-1 | Protein GRS
Type:
Apoptosis regulator protein
Mol. Mass.:
20130.01
Organism:
Homo sapiens (Human)
Description:
Residue:
175
  
Inhibitor
Name:
BDBM33056
Synonyms:
3-amino-N-(2-furanylmethyl)-5-oxo-7,8-dihydro-6H-thieno[2,3-b]quinoline-2-carboxamide 3-amino-N-(2-furylmethyl)-5-oxo-5,6,7,8-tetrahydrothieno[2,3-b]quinoline-2-carboxamide 3-azanyl-N-(furan-2-ylmethyl)-5-oxidanylidene-7,8-dihydro-6H-thieno[2,3-b]quinoline-2-carboxamide SMR000072940 | cid_2064238
Type:
Small organic molecule
Emp. Form.:
C17H15N3O3S
Mol. Mass.:
341.384
SMILES:
Nc1c(sc2nc3CCCC(=O)c3cc12)C(=O)NCc1ccco1
:
Substrate
Name:
FITC-conjugated-Bim BH3 Peptide
Synonyms:
FITC-Ahx-DMRPEIWIAQELRRIGDEFNAYYAR-OH
Type:
FITC-labeled Peptide
Mol. Mass.:
3112.46
Organism:
Description:
Residue:
25