Target
Bcl-2-related protein A1
Ligand
BDBM33099
Substrate
FITC-conjugated-Bim BH3 Peptide
Meas. Tech.
Multiplexed dose response screen for small molecule regulators of Bcl-2 family protein interactions, specifically Bim-Bfl-1.
pH
7.4±n/a
Temperature
277.15±n/a K
EC50
3330±n/a nM
Citation
 PubChem, PC Multiplexed dose response screen for small molecule regulators of Bcl-2 family protein interactions, specifically Bim-Bfl-1. PubChem Bioassay (2008)[AID] 
Target
Name:
Bcl-2-related protein A1
Synonyms:
B2LA1_HUMAN BCL2L5 Bcl-2-like protein 5 HBPA1 Protein BFL-1 | Protein GRS
Type:
Apoptosis regulator protein
Mol. Mass.:
20130.01
Organism:
Homo sapiens (Human)
Description:
Residue:
175
  
Inhibitor
Name:
BDBM33099
Synonyms:
2-[[(5E)-5-(4-acetoxybenzylidene)-4-keto-2-thiazolin-2-yl]thio]acetic acid ethyl ester MLS000327789 cid_5927217 ethyl 2-[[(5E)-5-[(4-acetyloxyphenyl)methylidene]-4-oxidanylidene-1,3-thiazol-2-yl]sulfanyl]ethanoate | ethyl 2-[[(5E)-5-[(4-acetyloxyphenyl)methylidene]-4-oxo-1,3-thiazol-2-yl]sulfanyl]acetate
Type:
Small organic molecule
Emp. Form.:
C16H15NO5S2
Mol. Mass.:
365.424
SMILES:
CCOC(=O)CSC1=NC(=O)\C(S1)=C/c1ccc(OC(C)=O)cc1
:
Substrate
Name:
FITC-conjugated-Bim BH3 Peptide
Synonyms:
FITC-Ahx-DMRPEIWIAQELRRIGDEFNAYYAR-OH
Type:
FITC-labeled Peptide
Mol. Mass.:
3112.46
Organism:
Description:
Residue:
25