Target
Bcl-2-related protein A1
Ligand
BDBM33115
Substrate
FITC-conjugated-Bim BH3 Peptide
Meas. Tech.
Multiplexed dose response screen for small molecule regulators of Bcl-2 family protein interactions, specifically Bim-Bfl-1.
pH
7.4±n/a
Temperature
277.15±n/a K
EC50
1360±n/a nM
Citation
 PubChem, PC Multiplexed dose response screen for small molecule regulators of Bcl-2 family protein interactions, specifically Bim-Bfl-1. PubChem Bioassay (2008)[AID] 
Target
Name:
Bcl-2-related protein A1
Synonyms:
B2LA1_HUMAN BCL2L5 Bcl-2-like protein 5 HBPA1 Protein BFL-1 | Protein GRS
Type:
Apoptosis regulator protein
Mol. Mass.:
20130.01
Organism:
Homo sapiens (Human)
Description:
Residue:
175
  
Inhibitor
Name:
BDBM33115
Synonyms:
1,5-diphenyl-3-(phenylcarbonyl)-3a,6a-dihydropyrrolo[3,4-c]pyrazole-4,6-dione 3-benzoyl-1,5-diphenyl-3a,6a-dihydropyrrolo[3,4-c]pyrazole-4,6-dione MLS000573554 cid_2901205
Type:
Small organic molecule
Emp. Form.:
C24H17N3O3
Mol. Mass.:
395.4101
SMILES:
Oc1n(-c2ccccc2)c(=O)c2c([nH]n(-c3ccccc3)c12)C(=O)c1ccccc1
:
Substrate
Name:
FITC-conjugated-Bim BH3 Peptide
Synonyms:
FITC-Ahx-DMRPEIWIAQELRRIGDEFNAYYAR-OH
Type:
FITC-labeled Peptide
Mol. Mass.:
3112.46
Organism:
Description:
Residue:
25