Target
Serine/threonine-protein kinase Chk2
Ligand
BDBM33212
Substrate
biotinylated CDC25C peptide
Meas. Tech.
CHK Kinase Inhibition Assay
pH
7.4±n/a
Temperature
296.15±n/a K
IC50
74000±n/a nM
Citation
 Matthews, TPKlair, SBurns, SBoxall, KCherry, MFisher, MWestwood, IMWalton, MIMcHardy, TCheung, KMVan Montfort, RWilliams, DAherne, GWGarrett, MDReader, JCollins, I Identification of inhibitors of checkpoint kinase 1 through template screening. J Med Chem 52:4810-9 (2009)  
Target
Name:
Serine/threonine-protein kinase Chk2
Synonyms:
CDS1 CHK2 Checkpoint Kinase (Chk2) Serine/threonine-protein kinase Chek2 | Serine/threonine-protein kinase Chk1/2
Type:
Protein
Mol. Mass.:
60908.59
Organism:
Homo sapiens (Human)
Description:
O96017
Residue:
543
  
Inhibitor
Name:
BDBM33212
Synonyms:
pyrazolo pyridine, 11
Type:
Small organic molecule
Emp. Form.:
C14H19N5O3
Mol. Mass.:
305.3324
SMILES:
CCOC(=O)c1cnc2[nH]ncc2c1N1CCOC(CN)C1
:
Substrate
Name:
biotinylated CDC25C peptide
Synonyms:
Type:
biotinylated peptide
Mol. Mass.:
3148.69
Organism:
Description:
Residue:
27