Target
Heat shock protein HSP 90-beta
Ligand
BDBM33245
Substrate
BDBM15527
Meas. Tech.
Fluorescence Polarization (FP) Assay
pH
7.4±n/a
Temperature
296.15±n/a K
IC50
84±n/a nM
Citation
 Brough, PABarril, XBorgognoni, JChene, PDavies, NGDavis, BDrysdale, MJDymock, BEccles, SAGarcia-Echeverria, CFromont, CHayes, AHubbard, REJordan, AMJensen, MRMassey, AMerrett, APadfield, AParsons, RRadimerski, TRaynaud, FIRobertson, ARoughley, SDSchoepfer, JSimmonite, HSharp, SYSurgenor, AValenti, MWalls, SWebb, PWood, MWorkman, PWright, L Combining hit identification strategies: fragment-based and in silico approaches to orally active 2-aminothieno[2,3-d]pyrimidine inhibitors of the Hsp90 molecular chaperone. J Med Chem 52:4794-809 (2009)  
Target
Name:
Heat shock protein HSP 90-beta
Synonyms:
HS90B_HUMAN HSP 90 HSP90B HSPCB Heat shock protein HSP 90 (Hsp90)
Type:
Molecular Chaperone
Mol. Mass.:
83229.45
Organism:
Homo sapiens (Human)
Description:
P08238
Residue:
724
  
Inhibitor
Name:
BDBM33245
Synonyms:
thieno[2,3-d]pyrimidine, 34l
Type:
Small organic molecule
Emp. Form.:
C20H23Cl2N5O3S
Mol. Mass.:
484.399
SMILES:
CCNC(=O)c1cc2c(nc(N)nc2s1)-c1cc(OCCNCCOC)c(Cl)cc1Cl
:
Substrate
Name:
BDBM15527
Synonyms:
5-[({4-[3-(5-chloro-2,4-dihydroxyphenyl)-5-(ethylcarbamoyl)-1H-pyrazol-4-yl]phenyl}methyl)carbamoyl]-2-(6-hydroxy-3-oxo-3H-xanthen-9-yl)benzoic acid VER-00051001
Type:
Fluorescently labeled probe
Emp. Form.:
C40H29ClN4O9
Mol. Mass.:
745.133
SMILES:
CCNC(=O)c1[nH]nc(c1-c1ccc(CNC(=O)c2ccc(c(c2)C(O)=O)-c2c3ccc(O)cc3oc3cc(=O)ccc23)cc1)-c1cc(Cl)c(O)cc1O
: