Target
Genome polyprotein [1393-1439,E1407V]/[1476-1660,R1508K,A1566M]
Ligand
BDBM33258
Substrate
BDBM33248
Meas. Tech.
Enzyme Inhibition Assay
pH
7.5±n/a
Temperature
310.15±n/a K
IC50
>100000±n/a nM
Citation
 Bodenreider, CBeer, DKeller, THSonntag, SWen, DYap, LYau, YHShochat, SGHuang, DZhou, TCaflisch, ASu, XCOzawa, KOtting, GVasudevan, SGLescar, JLim, SP A fluorescence quenching assay to discriminate between specific and nonspecific inhibitors of dengue virus protease. Anal Biochem 395:195-204 (2009)  
Target
Name:
Genome polyprotein [1393-1439,E1407V]/[1476-1660,R1508K,A1566M]
Synonyms:
Dengue Virus 1 (DENV1) NS2B-NS3 Protease
Type:
Cofactor/Enzyme
Mol. Mass.:
Description:
Components:
This complex has 2 components.
Component 1
Name:
Genome polyprotein [1393-1439,E1407V]
Synonyms:
Flavivirus non-structural protein NS2B POLG_DEN1S
Type:
Cofactor Domain
Mol. Mass.:
5202.48
Organism:
Dengue virus 1(Hawaii)
Description:
P33478[1393-1439,E1407V]
Residue:
47
  
Component 2
Name:
Genome polyprotein [1476-1660,R1508K,A1566M]
Synonyms:
Flavivirus NS3 serine protease POLG_DEN1W
Type:
Catalytic Domain
Mol. Mass.:
19899.28
Organism:
Dengue virus 1(Hawaii)
Description:
P17763[1476-1660,R1508K,A1566M]
Residue:
185
  
Inhibitor
Name:
BDBM33258
Synonyms:
phthalazine-based compound, 9
Type:
Small organic molecule
Emp. Form.:
C26H25N9
Mol. Mass.:
463.537
SMILES:
Nc1ccc2c(Nc3ccc(cc3)C3=NCCN3)nnc(Nc3ccc(cc3)C3=NCCN3)c2c1
:
Substrate
Name:
BDBM33248
Synonyms:
Bz-Nle-Lys-Arg-Arg-AMC benzoyl-Nle-Lys-Arg-Arg-7-amido-4-methylcoumarin
Type:
fluorogenic tetrapeptide substrate
Emp. Form.:
Mol. Mass.:
SMILES:
: