Target
Genome polyprotein [1394-1440]/[1476-1660,T1585M]
Ligand
BDBM33258
Substrate
BDBM33248
Meas. Tech.
Enzyme Inhibition Assay
IC50
>100000±n/a nM
Citation
 Bodenreider, CBeer, DKeller, THSonntag, SWen, DYap, LYau, YHShochat, SGHuang, DZhou, TCaflisch, ASu, XCOzawa, KOtting, GVasudevan, SGLescar, JLim, SP A fluorescence quenching assay to discriminate between specific and nonspecific inhibitors of dengue virus protease. Anal Biochem 395:195-204 (2009)  
Target
Name:
Genome polyprotein [1394-1440]/[1476-1660,T1585M]
Synonyms:
Dengue Virus 3 (DENV3) NS2B-NS3 Protease
Type:
Cofactor/Enzyme
Mol. Mass.:
Description:
Components:
This complex has 2 components.
Component 1
Name:
Genome polyprotein [1394-1440]
Synonyms:
Flavivirus non-structural protein NS2B POLG_DEN3P
Type:
Cofactor Domain
Mol. Mass.:
5254.11
Organism:
Dengue virus 3 (strain S221/03)
Description:
P27915[1394-1440]
Residue:
47
  
Component 2
Name:
Genome polyprotein [1476-1660,T1585M]
Synonyms:
Flavivirus NS3 serine protease POLG_DEN3S | pol
Type:
Catalytic Domain
Mol. Mass.:
20135.05
Organism:
Dengue virus 3 (strain S221/03)
Description:
Q6YMS4[1476-1660,T1585M]
Residue:
185
  
Inhibitor
Name:
BDBM33258
Synonyms:
phthalazine-based compound, 9
Type:
Small organic molecule
Emp. Form.:
C26H25N9
Mol. Mass.:
463.537
SMILES:
Nc1ccc2c(Nc3ccc(cc3)C3=NCCN3)nnc(Nc3ccc(cc3)C3=NCCN3)c2c1
:
Substrate
Name:
BDBM33248
Synonyms:
Bz-Nle-Lys-Arg-Arg-AMC benzoyl-Nle-Lys-Arg-Arg-7-amido-4-methylcoumarin
Type:
fluorogenic tetrapeptide substrate
Emp. Form.:
Mol. Mass.:
SMILES:
: