Target
Non-receptor tyrosine-protein kinase TYK2 [V731I]
Ligand
BDBM399768
Substrate
Meas. Tech.
TYK2 JH2 Domain Binding Assay
Kd
<0.1±n/a nM
Citation
 Greenwood, JRHarriman, GCLeit de Moradei, SMMasse, CEMcLean, THMondal, S TYK2 inhibitors and uses thereof US Patent  US10323036 Publication Date 6/18/2019 
Target
Name:
Non-receptor tyrosine-protein kinase TYK2 [V731I]
Synonyms:
JH2 domain (V731I) TYK2 (V731I) | TYK2_HUMAN
Type:
Enzyme Catalytic Domain
Mol. Mass.:
133680.06
Organism:
Homo sapiens (Human)
Description:
P29597[V731I]
Residue:
1187
  
Inhibitor
Name:
BDBM399768
Synonyms:
US10323036, Compound VIII-16 US11220508, Compound VIII-16
Type:
Small organic molecule
Emp. Form.:
C22H19ClN10OS
Mol. Mass.:
506.971
SMILES:
COc1c(Nc2cc(Nc3ccc(C)nn3)ncc2-c2ncc(Cl)s2)cccc1-c1nnn(C)n1
: