Target
Genome polyprotein [1424-1463]/[1502-1685]
Ligand
BDBM33262
Substrate
BDBM33263
Meas. Tech.
Protease Inhibition Assay
pH
8.5±n/a
Temperature
296.15±n/a K
Ki
1088000±162000 nM
Citation
 Ganesh, VKMuller, NJudge, KLuan, CHPadmanabhan, RMurthy, KH Identification and characterization of nonsubstrate based inhibitors of the essential dengue and West Nile virus proteases. Bioorg Med Chem 13:257-64 (2005)  
Target
Name:
Genome polyprotein [1424-1463]/[1502-1685]
Synonyms:
WNV CF40.Gly.NS3Pro West Nile Virus (WNV) NS2B-NS3 Protease
Type:
Cofactor/Enzyme
Mol. Mass.:
Description:
It is the catalytically active recombinant WNV protease, consisting of a 40-residue component of cofactor NS2B tethered via a nonapeptide (G4SG4) to the N-terminal 184 residues of NS3.
Components:
This complex has 2 components.
Component 1
Name:
Genome polyprotein [1424-1463]
Synonyms:
Flavivirin protease NS2B regulatory subunit POLG_WNV
Type:
Cofactor Domain
Mol. Mass.:
4431.59
Organism:
West Nile virus (WNV)
Description:
P06935[1424-1463]
Residue:
40
  
Component 2
Name:
Genome polyprotein [1502-1685]
Synonyms:
Flavivirin protease NS3 catalytic subunit POLG_WNV
Type:
Catalytic Subunit
Mol. Mass.:
19839.27
Organism:
West Nile virus (WNV)
Description:
P06935[1502-1685]
Residue:
184
  
Inhibitor
Name:
BDBM33262
Synonyms:
biguanidine, 3
Type:
Small organic molecule
Emp. Form.:
C8H16N8
Mol. Mass.:
224.2662
SMILES:
[#7]-[#6](-[#7])-[#7]-[#7]-c1ccc(-[#7]\[#7]=[#6](\[#7])-[#7])cc1
:
Substrate
Name:
BDBM33263
Synonyms:
AMC, 7-amido-4-methylcoumarin | Boc-Gly-Arg-Arg-AMC
Type:
fluorogenic peptide substrate
Emp. Form.:
Mol. Mass.:
SMILES:
: