Target
Fatty-acid amide hydrolase 1
Ligand
BDBM399797
Substrate
Meas. Tech.
In Vitro Competitive Activity-Based Protein Profiling
IC50
<100±n/a nM
Citation
 Grice, CAJones, TKDuncan, KKCisar, JSMerit, JEWeber, OD Pyrazole compounds and methods of making and using same US Patent  US10323038 Publication Date 6/18/2019 
Target
Name:
Fatty-acid amide hydrolase 1
Synonyms:
Anandamide amidohydrolase FAAH1_MOUSE Faah1 Fatty-acid amide hydrolase (FAAH) Oleamide hydrolase 1
Type:
Hydrolase; single-pass membrane protein; homodimer
Mol. Mass.:
63227.28
Organism:
Mus musculus (mouse)
Description:
Mouse brain membranes were used in the assay.
Residue:
579
  
Inhibitor
Name:
BDBM399797
Synonyms:
N-(1-(7-(2-chlorobenzyl)-2,7- diazaspiro[4.4]nonane-2-carbonyl)-1H- pyrazol-4-yl)-N-methylacetamide | US10323038, Example 50
Type:
Small organic molecule
Emp. Form.:
C21H26ClN5O2
Mol. Mass.:
415.916
SMILES:
CN(C(C)=O)c1cnn(c1)C(=O)N1CCC2(CCN(Cc3ccccc3Cl)C2)C1
: