Target
Monoglyceride lipase
Ligand
BDBM399824
Substrate
Meas. Tech.
In Vitro Competitive Activity-Based Protein Profiling
IC50
<100±n/a nM
Citation
 Grice, CAJones, TKDuncan, KKCisar, JSMerit, JEWeber, OD Pyrazole compounds and methods of making and using same US Patent  US10323038 Publication Date 6/18/2019 
Target
Name:
Monoglyceride lipase
Synonyms:
MAG lipase Mgll Monoglyceride Lipase (MGL)
Type:
Hydrolase
Mol. Mass.:
33391.67
Organism:
Mus musculus (mouse)
Description:
Assays were using membranes of recombinant MAG Lipase transiently transfected in COS-7 cells.
Residue:
303
  
Inhibitor
Name:
BDBM399824
Synonyms:
N-(1-(5-(3-chloro-5-(pyrrolidin-1- yl)benzyl)octahydropyrrolo[3,4- c]pyrrole-2-carbonyl)-1H-pyrazol-4-yl) N-methylacetamide | US10323038, Example 110
Type:
Small organic molecule
Emp. Form.:
C24H31ClN6O2
Mol. Mass.:
470.995
SMILES:
CN(C(C)=O)c1cnn(c1)C(=O)N1CC2CN(Cc3cc(Cl)cc(c3)N3CCCC3)CC2C1
: