Target
Fatty-acid amide hydrolase 1
Ligand
BDBM399875
Substrate
Meas. Tech.
In Vitro Competitive Activity-Based Protein Profiling
IC50
<100±n/a nM
Citation
 Grice, CAJones, TKDuncan, KKCisar, JSMerit, JEWeber, OD Pyrazole compounds and methods of making and using same US Patent  US10323038 Publication Date 6/18/2019 
Target
Name:
Fatty-acid amide hydrolase 1
Synonyms:
Anandamide amidohydrolase FAAH1_MOUSE Faah1 Fatty-acid amide hydrolase (FAAH) Oleamide hydrolase 1
Type:
Hydrolase; single-pass membrane protein; homodimer
Mol. Mass.:
63227.28
Organism:
Mus musculus (mouse)
Description:
Mouse brain membranes were used in the assay.
Residue:
579
  
Inhibitor
Name:
BDBM399875
Synonyms:
N-methyl-N-(1-(4-((3-methylbiphenyl-4 yl)methyl)piperazine-1-carbonyl)-1H- pyrazol-4-yl)acetamide | US10323038, Example 201
Type:
Small organic molecule
Emp. Form.:
C25H29N5O2
Mol. Mass.:
431.5301
SMILES:
CN(C(C)=O)c1cnn(c1)C(=O)N1CCN(Cc2ccc(cc2C)-c2ccccc2)CC1
: