Target
Sortase family protein
Ligand
BDBM33310
Substrate
BDBM33299
Meas. Tech.
Fluorescence Resonance Energy Transfer (FRET) Assay
pH
7.5±n/a
Temperature
298.15±n/a K
IC50
109000±10000 nM
Citation
 Suree, NYi, SWThieu, WMarohn, MDamoiseaux, RChan, AJung, MEClubb, RT Discovery and structure-activity relationship analysis of Staphylococcus aureus sortase A inhibitors. Bioorg Med Chem 17:7174-85 (2009)  
Target
Name:
Sortase family protein
Synonyms:
Sortase | Sortase A (SrtA)
Type:
Enzyme
Mol. Mass.:
23546.15
Organism:
Staphylococcus aureus
Description:
Residue:
206
  
Inhibitor
Name:
BDBM33310
Synonyms:
rhodanine, 1-11
Type:
Small organic molecule
Emp. Form.:
C16H12ClNO2S2
Mol. Mass.:
349.855
SMILES:
CCN1C(=S)S\C(=C/c2ccc(o2)-c2cccc(Cl)c2)C1=O
:
Substrate
Name:
BDBM33299
Synonyms:
Abz-LPETG-Dap(Dnp) | o-aminobenzoyl (Abz)-LPETG-diaminopropionic acid-dinitrophenyl- NH2
Type:
internally quenched fluorescent substrate
Emp. Form.:
Mol. Mass.:
SMILES:
: