Target
Sortase A
Ligand
BDBM33330
Substrate
BDBM33299
Meas. Tech.
Fluorescence Resonance Energy Transfer (FRET) Assay
IC50
1200±n/a nM
Citation
 Suree, NYi, SWThieu, WMarohn, MDamoiseaux, RChan, AJung, MEClubb, RT Discovery and structure-activity relationship analysis of Staphylococcus aureus sortase A inhibitors. Bioorg Med Chem 17:7174-85 (2009)  
Target
Name:
Sortase A
Synonyms:
LPXTG-site transpeptidase family protein Sortase A (SrtA) | srtA
Type:
Enzyme
Mol. Mass.:
23150.63
Organism:
Bacillus anthracis
Description:
A0A0E0VVI0
Residue:
210
  
Inhibitor
Name:
BDBM33330
Synonyms:
pyridazinone, 2-17
Type:
Small organic molecule
Emp. Form.:
C24H22N4O4S2
Mol. Mass.:
494.586
SMILES:
CCOc1c(SSc2cnn(-c3ccccc3)c(=O)c2OCC)cnn(-c2ccccc2)c1=O
:
Substrate
Name:
BDBM33299
Synonyms:
Abz-LPETG-Dap(Dnp) | o-aminobenzoyl (Abz)-LPETG-diaminopropionic acid-dinitrophenyl- NH2
Type:
internally quenched fluorescent substrate
Emp. Form.:
Mol. Mass.:
SMILES:
: