Target
Vascular endothelial growth factor A
Ligand
BDBM107709
Substrate
Meas. Tech.
VEGF ELISA Assay
EC50
>100000±n/a nM
Citation
 Kawamoto, RMWu, SEvdokimov, AGGreis, KDBoyer, ASWarshakoon, NC Prolyl hydroxylase inhibitors and methods of use US Patent  USRE47437 Publication Date 6/18/2019 
Target
Name:
Vascular endothelial growth factor A
Synonyms:
VEGF VEGFA VPF Vascular endothelial growth factor A (VEGF) Vascular permeability factor
Type:
Protein
Mol. Mass.:
27063.81
Organism:
Homo sapiens (Human)
Description:
P15692
Residue:
232
  
Inhibitor
Name:
BDBM107709
Synonyms:
US11426393, Compound Table XV.15 US8722895, 15: {[5-(4-Isopropoxyphenyl)-3- hydroxypyridine-2-carbonyl]amino}-acetic acid USRE47437, Example {[5-(4-Isopropoxyphenyl)-3-hydroxypyridine-2-carbonyl]amino}-aceticacid
Type:
Small organic molecule
Emp. Form.:
C17H18N2O5
Mol. Mass.:
330.3352
SMILES:
CC(C)Oc1ccc(cc1)-c1cnc(C(=O)NCC(O)=O)c(O)c1
: