Target
Egl nine homolog 1
Ligand
BDBM400041
Substrate
Meas. Tech.
EGLN-1 Activity Assay
IC50
190±n/a nM
Citation
 Kawamoto, RMWu, SEvdokimov, AGGreis, KDBoyer, ASWarshakoon, NC Prolyl hydroxylase inhibitors and methods of use US Patent  USRE47437 Publication Date 6/18/2019 
Target
Name:
Egl nine homolog 1
Synonyms:
C1orf12 EGLN1_HUMAN Hypoxia-inducible factor prolyl hydroxylase 2 (HIF-PH2) Prolyl hydroxylase domain-containing protein 2 (PHD2)
Type:
Protein
Mol. Mass.:
46035.59
Organism:
Homo sapiens (Human)
Description:
Q9GZT9
Residue:
426
  
Inhibitor
Name:
BDBM400041
Synonyms:
US11426393, Compound Table XV.20 | USRE47437, Example {[5-(3-Cyanophenyl)-3-hydroxypyridine-2-carbonyl]amino}-acetic acid
Type:
Small organic molecule
Emp. Form.:
C15H11N3O4
Mol. Mass.:
297.2655
SMILES:
OC(=O)CNC(=O)c1ncc(cc1O)-c1cccc(c1)C#N
: