Target
Dimer of Gag-Pol polyprotein [489-587]
Ligand
BDBM793
Substrate
Fluorogenic substrate
Meas. Tech.
Protease Inhibition Assay
pH
6.2±n/a
Temperature
310.15±n/a K
Ki
0.0068±n/a nM
Km
22000±n/a nM
Comments
The estimated Ki value is approximately 1,000 times lower than the IC50 reported in Chem. Pharm. Bull. 40:2251-2253. This discrepancy can be explained by the fact that apparent IC50 will exceed actual Ki value for tight-binding inhibitor when the enzyme concentrationis higher than the Ki value. In general, the lower the Ki, thegreater will be the discrepancy. In addition, Ki values for HIV protease inhibitors are known to be lower at higher ionic strengths (Antiviral Chem. Chemother. 2:65-73)
Citation
 Kageyama, SMimoto, TMurakawa, YNomizu, MFord, HShirasaka, TGulnik, SErickson, JTakada, KHayashi, H In vitro anti-human immunodeficiency virus (HIV) activities of transition state mimetic HIV protease inhibitors containing allophenylnorstatine. Antimicrob Agents Chemother 37:810-7 (1993)  
Target
Name:
Dimer of Gag-Pol polyprotein [489-587]
Synonyms:
HIV-1 Protease
Type:
Protein Complex
Mol. Mass.:
Description:
Components:
This complex has 2 components.
Component 1
Name:
Gag-Pol polyprotein [489-587]
Synonyms:
HIV protease HIV-1 Protease chain A POL_HV1N5 | gag-pol
Type:
Enzyme Subunit
Mol. Mass.:
10822.21
Organism:
Human immunodeficiency virus type 1
Description:
P12497[489-587]
Residue:
99
  
Component 2
Name:
Gag-Pol polyprotein [489-587]
Synonyms:
HIV protease HIV-1 Protease chain A POL_HV1N5 | gag-pol
Type:
Enzyme Subunit
Mol. Mass.:
10822.21
Organism:
Human immunodeficiency virus type 1
Description:
P12497[489-587]
Residue:
99
  
Inhibitor
Name:
BDBM793
Synonyms:
(2S)-N-[(2S,3S)-4-[(4R)-4-(tert-butylcarbamoyl)-5,5-dimethyl-1,3-thiazolidin-3-yl]-3-hydroxy-4-oxo-1-phenylbutan-2-yl]-2-[2-(naphthalen-1-yloxy)acetamido]butanediamide Noa-Asn-Apns-Dmt-NH-tBu
Type:
Small organic molecule
Emp. Form.:
C36H45N5O7S
Mol. Mass.:
691.837
SMILES:
CC(C)(C)NC(=O)[C@H]1N(CSC1(C)C)C(=O)[C@@H](O)[C@H](Cc1ccccc1)NC(=O)[C@H](CC(N)=O)NC(=O)COc1cccc2ccccc12
:
Substrate
Name:
Fluorogenic substrate
Synonyms:
Type:
Peptide
Mol. Mass.:
4443.87
Organism:
Description:
Residue:
41